Kydas
type: Person
type: Concept
is part of: roman provincial numismatics
definition: Magistrate (cretarch) attested in Cnossus (Crete), Gortyn (Crete) under Roman Republic..
in scheme: id
has membership: issuer