Publius Salpa
type: Person
type: Concept
is part of: roman provincial numismatics
definition: Magistrate (praefectus duovir) attested in Lepida-Celsa (Hispania) under Roman Republic..
in scheme: id
has membership: issuer