Sept(imius?)
type: Person
type: Concept
is part of: roman provincial numismatics
definition: Magistrate (duovir) attested in Uncertain Sicilian mint (Sicily) under Augustus..
in scheme: id
has membership: issuer