Lucius Aurelius Hephaistion
type: Person
type: Concept
is part of: roman provincial numismatics
definition: Magistrate (first archon for the second time) attested in Daldis (Lydia) under Gordian III..
in scheme: id
has membership: issuer