Aurelius Bakchios
type: Person
type: Concept
is part of: roman provincial numismatics
definition: Magistrate (grammateus) attested in Nysa (Lydia) under Gordian III..
in scheme: id
has membership: issuer