Aurelius Theodotos II
type: Person
type: Concept
is part of: roman provincial numismatics
definition: Magistrate (strategos) attested in Magnesia ad Sipylum (Lydia) under Gordian III..
in scheme: id
has membership: issuer