Titus Flavius Asiaticus
type: Person
type: Concept
is part of: roman provincial numismatics
definition: Magistrate (first archon and epimeletes) attested in Miletopolis (Mysia) under Hadrian..
in scheme: id
has membership: issuer