Pamphilos, son of Polemon
type: Person
type: Concept
is part of: roman provincial numismatics
definition: Magistrate attested in Cidrama (Caria) under Antoninus Pius..
in scheme: id
has membership: issuer