Ariston
type: Person
type: Concept
is part of: roman provincial numismatics
definition: Magistrate (in office for the third time) attested in Seleucia ad Calycadnum (Cilicia) under Hadrian..
in scheme: id
has membership: issuer