Apollonios, son of Apellas
type: Person
type: Concept
is part of: roman provincial numismatics
definition: Magistrate attested in Uncertain (Uncertain) under Antoninus Pius..
in scheme: id
has membership: issuer