Publius Juventius Celsus
type: Person
type: Concept
is part of: roman provincial numismatics
definition: Magistrate attested in Pessinus (Galatia) under Marcus Aurelius..
in scheme: id
has membership: issuer