Gaius Terentius Sura
type: Person
type: Concept
is part of: roman provincial numismatics
definition: Magistrate (duovir) attested in Ercavica (Hispania) under Caligula..
in scheme: id
has membership: issuer