Lucius Aelius Pigres
type: Person
type: Concept
is part of: roman provincial numismatics
definition: Magistrate (asiarch for the third time) attested in Laodicea ad Lycum (Phrygia) under Caracalla..
in scheme: id
has membership: issuer