Marcus S— R—
type: Person
type: Concept
is part of: roman provincial numismatics
definition: Magistrate (quaestor) attested in Emporiae (Hispania) under uncertain reign..
in scheme: id
has membership: issuer