Amo—
type: Person
type: Concept
is part of: roman provincial numismatics
definition: Magistrate attested in Uncertain Syrian mint of Zeus tetradrachms (Syria) under Tiberius..
in scheme: id
has membership: issuer