Gaius Asinius Gallus
type: Person
type: Concept
is part of: roman provincial numismatics
definition: Magistrate (proconsul) attested in Temnus (Aeolis) under Augustus..
in scheme: id
has membership: issuer