Gaius Daphnes, son of Dometianus
type: Person
type: Concept
is part of: roman provincial numismatics
definition: Magistrate attested in Magnesia ad Maeandrum (Ionia) under Valerian and Gallienus..
in scheme: id
has membership: issuer