Valerius Nikias
type: Person
type: Concept
is part of: roman provincial numismatics
definition: Magistrate (strategos and prytanis for the second time) attested in Metropolis (Ionia) under Valerian and Gallienus..
in scheme: id
has membership: issuer