Gaius Marcius, son of Lucius
type: Person
type: Concept
is part of: roman provincial numismatics
definition: Magistrate (duovir) attested in Lipara (Sicily) under Roman Republic..
in scheme: id
has membership: issuer