Aurelius Antipatros, son of Pamphilos
type: Person
type: Concept
is part of: roman provincial numismatics
definition: Magistrate (first archon) attested in Cadi (Phrygia) under Gallienus (sole reign)..
in scheme: id
has membership: issuer