Aurelius Hermes
type: Person
type: Concept
is part of: roman provincial numismatics
definition: Magistrate (panegyriarch) attested in Apamea (Phrygia) under Valerian and Gallienus..
in scheme: id
has membership: issuer