Asiatikos, son of Hermogenes
type: Person
type: Concept
is part of: roman provincial numismatics
definition: Magistrate (strategos) attested in Thyatira (Lydia) under Septimius Severus..
in scheme: id
has membership: issuer