Aurelius Zeuxis, son of Ploutiades
type: Person
type: Concept
is part of: roman provincial numismatics
definition: Magistrate (strategos) attested in Mostene (Lydia) under Gallienus (sole reign)..
in scheme: id
has membership: issuer