Lucius Pomponius Marcus
type: Person
type: Concept
is part of: roman provincial numismatics
definition: Magistrate (priest) attested in Tabala (Lydia) under Septimius Severus..
in scheme: id
has membership: issuer