Helenos, son of Apollonides
type: Person
type: Concept
is part of: roman provincial numismatics
definition: Magistrate (first in office for the second time) attested in Silandus (Lydia) under Septimius Severus..
in scheme: id
has membership: issuer