Marcus Iulius Aelianus
type: Person
type: Concept
is part of: roman provincial numismatics
definition: Magistrate (first archon) attested in Temenothyrae (Phrygia) under Caracalla..
in scheme: id
has membership: issuer