Andronikos IV, great-great-grandson of Iollas
type: Person
type: Concept
is part of: roman provincial numismatics
definition: Magistrate (first archon and stephanephoros) attested in Saitta (Lydia) under Septimius Severus..
in scheme: id
has membership: issuer