Athenagoras, son of Chaireas
type: Person
type: Concept
is part of: roman provincial numismatics
definition: Magistrate (epimeletes 'of everything') attested in Mastaura (Lydia) under Tiberius..
in scheme: id
has membership: issuer