Flavius III, great-grandson of Licinnianus
type: Person
type: Concept
is part of: roman provincial numismatics
definition: Magistrate (first archon and stephanephoros) attested in Maeonia (Lydia) under Caracalla..
in scheme: id
has membership: issuer