Herakleides II, grandson of Zeuxis
type: Person
type: Concept
is part of: roman provincial numismatics
definition: Magistrate (first archon for the third time and stephanephoros) attested in Maeonia (Lydia) under Septimius Severus..
in scheme: id
has membership: issuer