Flavius Antinous
type: Person
type: Concept
is part of: roman provincial numismatics
definition: Magistrate (strategos) attested in Phocaea (Ionia) under Antoninus Pius..
in scheme: id
has membership: issuer