Menestheus Isobounos
type: Person
type: Concept
is part of: roman provincial numismatics
definition: Magistrate (president of the college of the archons) attested in Aphrodisias (Caria) under Septimius Severus..
in scheme: id
has membership: issuer