Aurelius Artemidoros, son of Meliton II
type: Person
type: Concept
is part of: roman provincial numismatics
definition: Magistrate (grammateus) attested in Nysa (Lydia) under Philip I..
in scheme: id
has membership: issuer