Mousaios, son of Kallikrates
type: Person
type: Concept
is part of: roman provincial numismatics
definition: Magistrate (president) attested in Cidrama (Caria) under Caligula..
in scheme: id
has membership: issuer