Diophantos III
type: Person
type: Concept
is part of: roman provincial numismatics
definition: Magistrate (archon) attested in Cilbiani Superiores (Lydia) under Septimius Severus..
in scheme: id
has membership: issuer