Reginos, son of Zotikos
type: Person
type: Concept
is part of: roman provincial numismatics
definition: Magistrate attested in Magnesia ad Maeandrum (Ionia) under Elagabalus..
in scheme: id
has membership: issuer