Marcus Aurelius Dionysios II, grandson of Ikesios
type: Person
type: Concept
is part of: roman provincial numismatics
definition: Magistrate (grammateus) attested in Neapolis ad Harpasum (Caria) under Maximinus, uncertain reign..
in scheme: id
has membership: issuer