Claudius Honoratus, son of Val—
type: Person
type: Concept
is part of: roman provincial numismatics
definition: Magistrate (first archon) attested in Hadrianeia (Mysia) under Maximinus..
in scheme: id
has membership: issuer