Aulus Hirtuleius Niger
type: Person
type: Concept
is part of: roman provincial numismatics
definition: Magistrate (duovir) attested in Buthrotum (Epirus) under Augustus..
in scheme: id
has membership: issuer