Anthos, son of Nikon
type: Person
type: Concept
is part of: roman provincial numismatics
definition: Magistrate attested in Byzantium (Thrace) under Marcus Aurelius..
in scheme: id
has membership: issuer