Publius Aelius Demetrianos Celer
type: Person
type: Concept
is part of: roman provincial numismatics
definition: Magistrate (archon) attested in Cotiaeum (Phrygia) under Macrinus..
in scheme: id
has membership: issuer