Publius Claudius Attalos the sophist
type: Person
type: Concept
is part of: roman provincial numismatics
definition: Magistrate attested in Smyrna (Ionia) under Marcus Aurelius..
in scheme: id
has membership: issuer