Publius Aelius Daphnos
type: Person
type: Concept
is part of: roman provincial numismatics
definition: Magistrate attested in Germe (Mysia) under uncertain reign..
in scheme: id
has membership: issuer