Menandros, son of Glykon, of the tribe Demetrias (?)
type: Person
type: Concept
is part of: roman provincial numismatics
definition: Magistrate (strategos) attested in Ancyra (Phrygia) under uncertain reign..
in scheme: id
has membership: issuer