Gaius Poppaeus Sabinus
type: Person
type: Concept
is part of: roman provincial numismatics
definition: Magistrate (legatus Augusti pro praetore) attested in Aegina (Aegina) under Tiberius..
in scheme: id
has membership: issuer