Marcus Antonius Aris—
type: Person
type: Concept
is part of: roman provincial numismatics
definition: Magistrate attested in Dyme (Peloponnesus) under Roman Republic..
in scheme: id
has membership: issuer