—ym— Theodoros II
type: Person
type: Concept
is part of: roman provincial numismatics
definition: Magistrate (strategos) attested in Elaea (Aeolis) under Septimius Severus..
in scheme: id
has membership: issuer