Publius Tadius Chilo
type: Person
type: Concept
is part of: roman provincial numismatics
definition: Magistrate (duovir) attested in Corinth (Corinthia) under Roman Republic..
in scheme: id
has membership: issuer